Installing Playwolf plasmoid

ok i’m running opensuse 11.1 KDE4.2 beta2 and have installed all deve packages now i had the same setup for 11.0 and it worked flawlessly but now i get this error when running make

chris@linux-rvlc:~/Plasmoids/playwolf/build> make
9%] Generating ui_verticalPage.h
Generating playwolf.moc
Generating playercontroller.moc
Generating wolfbuttons.moc
Generating wolflabel.moc
Generating infowidget.moc
Generating wolfmeter.moc
18%] Generating ui_generalPage.h
27%] Generating ui_horizontalPage.h
Scanning dependencies of target plasma_applet_playwolf
36%] Building CXX object CMakeFiles/plasma_applet_playwolf.dir/plasma_applet_playwolf_automoc.o
45%] Building CXX object CMakeFiles/plasma_applet_playwolf.dir/playwolf.o
In file included from /home/chris/Plasmoids/playwolf/playwolf.h:37,
from /home/chris/Plasmoids/playwolf/playwolf.cpp:26:
/home/chris/Plasmoids/playwolf/wolfbuttons.h:35:23: error: Plasma/Icon: No such file or directory
In file included from /home/chris/Plasmoids/playwolf/playwolf.h:37,
from /home/chris/Plasmoids/playwolf/playwolf.cpp:26:
/home/chris/Plasmoids/playwolf/wolfbuttons.h:74: error: ISO C++ forbids declaration of ‘Icon’ with no type
/home/chris/Plasmoids/playwolf/wolfbuttons.h:74: error: invalid use of ‘::’
/home/chris/Plasmoids/playwolf/wolfbuttons.h:74: error: expected ‘;’ before ‘’ token
/home/chris/Plasmoids/playwolf/wolfbuttons.h:75: error: ISO C++ forbids declaration of ‘Icon’ with no type
/home/chris/Plasmoids/playwolf/wolfbuttons.h:75: error: invalid use of ‘::’
/home/chris/Plasmoids/playwolf/wolfbuttons.h:75: error: expected ‘;’ before ‘
’ token
/home/chris/Plasmoids/playwolf/wolfbuttons.h:76: error: ISO C++ forbids declaration of ‘Icon’ with no type
/home/chris/Plasmoids/playwolf/wolfbuttons.h:76: error: invalid use of ‘::’
/home/chris/Plasmoids/playwolf/wolfbuttons.h:76: error: expected ‘;’ before ‘’ token
/home/chris/Plasmoids/playwolf/wolfbuttons.h:77: error: ISO C++ forbids declaration of ‘Icon’ with no type
/home/chris/Plasmoids/playwolf/wolfbuttons.h:77: error: invalid use of ‘::’
/home/chris/Plasmoids/playwolf/wolfbuttons.h:77: error: expected ‘;’ before ‘
’ token
/home/chris/Plasmoids/playwolf/wolfbuttons.h:78: error: ISO C++ forbids declaration of ‘Icon’ with no type
/home/chris/Plasmoids/playwolf/wolfbuttons.h:78: error: invalid use of ‘::’
/home/chris/Plasmoids/playwolf/wolfbuttons.h:78: error: expected ‘;’ before ‘*’ token
make[2]: *** [CMakeFiles/plasma_applet_playwolf.dir/playwolf.o] Error 1
make[1]: *** [CMakeFiles/plasma_applet_playwolf.dir/all] Error 2
make: *** [all] Error 2

Any ideas or suggestions would be appreciated

bump bump bump

Not much point with the bump this is a voluntary forum and people will help if they can.
Bear in mind that it is Christmas and a lot of users are offline spending time with family and friends

merry xmas
/Geoff

EDIT there is a one-click here that may work better

thxs for the help but nope don’t work no biggy
its an issue with runtime