bumblebee Module 'nvidia' is not found.

When I try to run bumblebeed I get an error saying:
“[ERROR]Module ‘nvidia’ is not found.”
I’m on openSUSE 13.1 with kernel 3.11.10-17.2-x86_64.

/var/log/zypp/history:

# 2014-06-29 21:22:55 nvidia-bumblebee-337.25-7.1.x86_64.rpm installed ok
# Additional rpm output:
# check sums and md5 sums are ok
# ln: failed to create symbolic link '/usr/share/licenses/nvidia-utils/nvidia': File exists
# + '' -x /usr/sbin/dkms ']'
# + /usr/sbin/dkms add -m nvidia -v 337.25 --rpm_safe_upgrade
# Error! DKMS tree already contains: nvidia-337.25
# You cannot add the same module/version combo more than once.
# + /usr/sbin/dkms build -m nvidia -v 337.25
# 
# Kernel preparation unnecessary for this kernel.  Skipping...
# 
# Building module:
# cleaning build area...mktemp: failed to create file via template '/var/tmp/dkms/dkms.XXXXXX': No such file or directory
# Error! Unable to make temporary file.
# /usr/sbin/dkms: line 78: : No such file or directory
# 
# /usr/sbin/dkms: line 73: : No such file or directory
# make KERNELRELEASE=3.11.10-17-desktop -C /lib/modules/3.11.10-17-desktop/build SUBDIRS=/var/lib/dkms/nvidia/337.25/build modules...mktemp: failed to create file via template '/var/tmp/dkms/dkms.XXXXXX': No such file or directory
# Error! Unable to make temporary file.
# /usr/sbin/dkms: line 78: : No such file or directory
# 
# Error!  Build of nvidia.ko failed for: 3.11.10-17-desktop (x86_64)
# Consult the make.log in the build directory
# /var/lib/dkms/nvidia/337.25/build/ for more information.
# + /usr/sbin/dkms install -m nvidia -v 337.25
# 
# Kernel preparation unnecessary for this kernel.  Skipping...
# 
# Building module:
# cleaning build area...mktemp: failed to create file via template '/var/tmp/dkms/dkms.XXXXXX': No such file or directory
# Error! Unable to make temporary file.
# /usr/sbin/dkms: line 78: : No such file or directory
# 
# make KERNELRELEASE=3.11.10-17-desktop -C /lib/modules/3.11.10-17-desktop/build SUBDIRS=/var/lib/dkms/nvidia/337.25/build modules...mktemp: failed to create file via template '/var/tmp/dkms/dkms.XXXXXX': No such file or directory
# Error! Unable to make temporary file.
# /usr/sbin/dkms: line 78: : No such file or directory
# 
# Error!  Build of nvidia.ko failed for: 3.11.10-17-desktop (x86_64)
# Consult the make.log in the build directory
# /var/lib/dkms/nvidia/337.25/build/ for more information.
# + popd
# /usr/sbin/dkms: line 73: : No such file or directory
# 
2014-06-29 21:22:55|install|nvidia-bumblebee|337.25-7.1|x86_64|root@rensa.kvasta|Bumblebee|8439ad70786b7846e369265c4d185d9da9a301f96777249fb989805e9168274a|
# 2014-06-29 21:22:56 nvidia-bumblebee-32bit-337.25-7.1.x86_64.rpm installed ok
# Additional rpm output:
# check sums and md5 sums are ok
# 
2014-06-29 21:22:56|install|nvidia-bumblebee-32bit|337.25-7.1|x86_64|root@rensa.kvasta|Bumblebee|9cca654475453243969170717558f98e2f5383e2d42194e31c22d1f023257b25|

var/lib/dkms/nvidia/337.25/build/make.log:

DKMS make.log for nvidia-337.25 for kernel 3.11.10-17-desktop (x86_64)
Sun Jun 29 21:22:50 CEST 2014
make: Entering directory `/usr/src/linux-3.11.10-17-obj/x86_64/desktop'
  CC [M]  /var/lib/dkms/nvidia/337.25/build/nv.o
In file included from /usr/src/linux-3.11.10-17/arch/x86/include/asm/bitops.h:514:0,
                 from /usr/src/linux-3.11.10-17/include/linux/bitops.h:22,
                 from /usr/src/linux-3.11.10-17/include/linux/kernel.h:10,
                 from /usr/src/linux-3.11.10-17/include/linux/sched.h:15,
                 from /usr/src/linux-3.11.10-17/include/linux/utsname.h:5,
                 from /var/lib/dkms/nvidia/337.25/build/nv-linux.h:44,
                 from /var/lib/dkms/nvidia/337.25/build/nv.c:13:
/usr/src/linux-3.11.10-17/include/linux/bitops.h: In function ‘hweight_long’:
/usr/src/linux-3.11.10-17/include/asm-generic/bitops/const_hweight.h:27:70: warning: signed and unsigned type in conditional expression -Wsign-compare]
 #define hweight64(w) (__builtin_constant_p(w) ? __const_hweight64(w) : __arch_hweight64(w))
                                                                      ^
/usr/src/linux-3.11.10-17/include/linux/bitops.h:66:41: note: in expansion of macro ‘hweight64’
  return sizeof(w) == 4 ? hweight32(w) : hweight64(w);
                                         ^
In file included from /usr/src/linux-3.11.10-17/arch/x86/include/asm/cpumask.h:4:0,
                 from /usr/src/linux-3.11.10-17/arch/x86/include/asm/msr.h:10,
                 from /usr/src/linux-3.11.10-17/arch/x86/include/asm/processor.h:20,
                 from /usr/src/linux-3.11.10-17/arch/x86/include/asm/thread_info.h:22,
                 from /usr/src/linux-3.11.10-17/include/linux/thread_info.h:54,
                 from /usr/src/linux-3.11.10-17/include/linux/preempt.h:9,
                 from /usr/src/linux-3.11.10-17/include/linux/spinlock.h:50,
                 from /usr/src/linux-3.11.10-17/include/linux/seqlock.h:29,
                 from /usr/src/linux-3.11.10-17/include/linux/time.h:5,
                 from /usr/src/linux-3.11.10-17/include/uapi/linux/timex.h:56,
                 from /usr/src/linux-3.11.10-17/include/linux/timex.h:56,
                 from /usr/src/linux-3.11.10-17/include/linux/sched.h:17,
                 from /usr/src/linux-3.11.10-17/include/linux/utsname.h:5,
                 from /var/lib/dkms/nvidia/337.25/build/nv-linux.h:44,
                 from /var/lib/dkms/nvidia/337.25/build/nv.c:13:
/usr/src/linux-3.11.10-17/include/linux/cpumask.h: In function ‘cpumask_parse’:
/usr/src/linux-3.11.10-17/include/linux/cpumask.h:603:26: warning: signed and unsigned type in conditional expression -Wsign-compare]
  int len = nl ? nl - buf : strlen(buf);
                          ^
In file included from /usr/src/linux-3.11.10-17/include/uapi/linux/stddef.h:1:0,
                 from /usr/src/linux-3.11.10-17/include/linux/stddef.h:4,
                 from /usr/src/linux-3.11.10-17/include/uapi/linux/posix_types.h:4,
                 from /usr/src/linux-3.11.10-17/include/uapi/linux/types.h:13,
                 from /usr/src/linux-3.11.10-17/include/linux/types.h:5,
                 from /usr/src/linux-3.11.10-17/include/uapi/linux/capability.h:16,
                 from /usr/src/linux-3.11.10-17/include/linux/capability.h:15,
                 from /usr/src/linux-3.11.10-17/include/linux/sched.h:13,
                 from /usr/src/linux-3.11.10-17/include/linux/utsname.h:5,
                 from /var/lib/dkms/nvidia/337.25/build/nv-linux.h:44,
                 from /var/lib/dkms/nvidia/337.25/build/nv.c:13:
/usr/src/linux-3.11.10-17/arch/x86/include/asm/uaccess_64.h: In function ‘copy_from_user’:
/usr/src/linux-3.11.10-17/arch/x86/include/asm/uaccess_64.h:62:28: warning: comparison between signed and unsigned integer expressions -Wsign-compare]
  if (likely(sz == -1 || sz >= n))
                            ^
/usr/src/linux-3.11.10-17/include/linux/compiler.h:152:40: note: in definition of macro ‘likely’
 # define likely(x) __builtin_expect(!!(x), 1)
                                        ^
objdump: '/var/lib/dkms/nvidia/337.25/build/.tmp_nv.o': No such file
mv: kan inte ta status på ”/var/lib/dkms/nvidia/337.25/build/.tmp_nv.o”: Filen eller katalogen finns inte
make[3]: *** [/var/lib/dkms/nvidia/337.25/build/nv.o] Fel 1
make[2]: *** [_module_/var/lib/dkms/nvidia/337.25/build] Fel 2
make[1]: *** [sub-make] Error 2
make: *** [all] Error 2
make: Leaving directory `/usr/src/linux-3.11.10-17-obj/x86_64/desktop'

Nevermind, just reinstalled DKMS.