Results 1 to 7 of 7

Thread: updating klamav does not work

  1. #1
    topitz NNTP User

    Default updating klamav does not work


    greetings,
    i tried to install / compile klamav, but i get this weird error ...
    anyone has got an idea what's going on? ... here's the log:

    ... config.status: creating src/sqlite/Makefile
    config.status: creating config.h
    config.status: config.h is unchanged
    config.status: executing depfiles commands
    Good - your configure finished. Start make now
    ***** Running make...
    * admin/cvs.sh: line 636: admin/detect-autoconf.pl: Permission denied
    * admin/cvs.sh: line 636: admin/detect-autoconf.pl: Permission denied
    make all-recursive
    make[1]: Entering directory `/home/fenris/.klamav/klamav-0.44'
    * admin/cvs.sh: line 636: admin/detect-autoconf.pl: Permission denied
    * admin/cvs.sh: line 636: admin/detect-autoconf.pl: Permission denied
    Making all in doc
    make[2]: Entering directory `/home/fenris/.klamav/klamav-0.44/doc'
    Making all in .
    make[3]: Entering directory `/home/fenris/.klamav/klamav-0.44/doc'
    make[3]: Für das Ziel »all-am« ist nichts zu tun.
    make[3]: Leaving directory `/home/fenris/.klamav/klamav-0.44/doc'
    Making all in en
    make[3]: Entering directory `/home/fenris/.klamav/klamav-0.44/doc/en'
    make[3]: Für das Ziel »all« ist nichts zu tun.
    make[3]: Leaving directory `/home/fenris/.klamav/klamav-0.44/doc/en'
    make[2]: Leaving directory `/home/fenris/.klamav/klamav-0.44/doc'
    Making all in po
    make[2]: Entering directory `/home/fenris/.klamav/klamav-0.44/po'
    make[2]: Für das Ziel »all« ist nichts zu tun.
    make[2]: Leaving directory `/home/fenris/.klamav/klamav-0.44/po'
    Making all in src
    make[2]: Entering directory `/home/fenris/.klamav/klamav-0.44/src'
    Making all in icons
    make[3]: Entering directory
    `/home/fenris/.klamav/klamav-0.44/src/icons'
    make[3]: Für das Ziel »all« ist nichts zu tun.
    make[3]: Leaving directory
    `/home/fenris/.klamav/klamav-0.44/src/icons'
    Making all in about
    make[3]: Entering directory
    `/home/fenris/.klamav/klamav-0.44/src/about'
    make[3]: Für das Ziel »all« ist nichts zu tun.
    make[3]: Leaving directory
    `/home/fenris/.klamav/klamav-0.44/src/about'
    Making all in action
    make[3]: Entering directory
    `/home/fenris/.klamav/klamav-0.44/src/action'
    make[3]: Für das Ziel »all« ist nichts zu tun.
    make[3]: Leaving directory
    `/home/fenris/.klamav/klamav-0.44/src/action'
    Making all in arkollon
    make[3]: Entering directory
    `/home/fenris/.klamav/klamav-0.44/src/arkollon'
    make[3]: Für das Ziel »all« ist nichts zu tun.
    make[3]: Leaving directory
    `/home/fenris/.klamav/klamav-0.44/src/arkollon'
    Making all in sqlite
    make[3]: Entering directory
    `/home/fenris/.klamav/klamav-0.44/src/sqlite'
    make[3]: Für das Ziel »all« ist nichts zu tun.
    make[3]: Leaving directory
    `/home/fenris/.klamav/klamav-0.44/src/sqlite'
    Making all in klammail
    make[3]: Entering directory
    `/home/fenris/.klamav/klamav-0.44/src/klammail'
    if gcc -DHAVE_CONFIG_H -I. -I. -I../.. -I/opt/kde3/include
    -I/usr/lib/qt3/include -I. -DQT_THREAD_SUPPORT -D_REENTRANT -O2
    -MT clamdmail.o -MD -MP -MF ".deps/clamdmail.Tpo" -c -o clamdmail.o
    clamdmail.c; \
    then mv -f ".deps/clamdmail.Tpo" ".deps/clamdmail.Po"; else rm -f
    ".deps/clamdmail.Tpo"; exit 1; fi
    * clamdmail.c: In Funktion »clamdscan«:
    * clamdmail.c:163: Fehler: »CL_EFSYNC« nicht deklariert (erste
    Benutzung in dieser Funktion)
    * clamdmail.c:163: Fehler: (Jeder nicht deklarierte Bezeichner wird
    nur einmal aufgeführt
    * clamdmail.c:163: Fehler: für jede Funktion in der er auftritt.)
    * make[3]: *** [clamdmail.o] Fehler 1
    * make[2]: *** [all-recursive] Fehler 1
    make[3]: Leaving directory
    `/home/fenris/.klamav/klamav-0.44/src/klammail'
    make[2]: Leaving directory `/home/fenris/.klamav/klamav-0.44/src'
    make[1]: Leaving directory `/home/fenris/.klamav/klamav-0.44'
    * make[1]: *** [all-recursive] Fehler 1
    * make: *** [all] Fehler 2
    ***** Return value 2

    thanks for all your help ... theo
    p.s. a similar error msg pops up when updating clamav ... theo


    --
    topitz
    ------------------------------------------------------------------------
    topitz's Profile: http://forums.opensuse.org/member.php?userid=5467
    View this thread: http://forums.opensuse.org/showthread.php?t=401905


  2. #2
    deltaflyer44 NNTP User

    Default Re: updating klamav does not work


    Have you tried installing it from the repo's ? Much easier than trying
    to compile

    Andy


    --
    To be is to do = Immanuel Kant
    To do is to be = Descartes.
    Do be do be do = Frank Sinatra

    SuSE user since 7.0,Linux user since 1994
    ------------------------------------------------------------------------
    deltaflyer44's Profile: http://forums.opensuse.org/member.php?userid=95
    View this thread: http://forums.opensuse.org/showthread.php?t=401905


  3. #3
    caf4926 NNTP User

    Default Re: updating klamav does not work


    In agreement with Andy here. And to add. Sometimes the updates in the
    repo go wonky as the Clam part and Klam don't seem to get packaged
    together for the update, so you have to wait a day or two.


    --
    Box: Linux 2.6.25.18-0.2 x86_64 | OS 11.0 | (KDE4.1.82) "3.1" | M2N4-SLI
    | AMD 64 X2 5200+ | nVidia 8500GT | 2GB RAM
    Lap: OS 11.0 | Celeron 550 | (KDE 4.1.82 "release 3.1" | Intel 965 GM |
    Lenovo R61e | 1GB RAM
    ------------------------------------------------------------------------
    caf4926's Profile: http://forums.opensuse.org/member.php?userid=204
    View this thread: http://forums.opensuse.org/showthread.php?t=401905


  4. #4
    tsu2 NNTP User

    Default Re: updating klamav does not work


    There's a problem when installing from the repos, too.

    I originally posted this without resolution

    'klamav update fails KDE3.5/OpenSuSE11' (http://tinyurl.com/5m2x6s)


    --
    tsu2
    ------------------------------------------------------------------------
    tsu2's Profile: http://forums.opensuse.org/member.php?userid=2578
    View this thread: http://forums.opensuse.org/showthread.php?t=401905


  5. #5
    caf4926 NNTP User

    Default Re: updating klamav does not work


    Mine updated Yesterday. No issues. OS 11.0 as sig


    --
    Box: Linux 2.6.25.18-0.2 x86_64 | OS 11.0 | (KDE4.1.82) "3.1" | M2N4-SLI
    | AMD 64 X2 5200+ | nVidia 8500GT | 2GB RAM
    Lap: OS 11.0 | Celeron 550 | (KDE 4.1.82 "release 3.1" | Intel 965 GM |
    Lenovo R61e | 1GB RAM
    ------------------------------------------------------------------------
    caf4926's Profile: http://forums.opensuse.org/member.php?userid=204
    View this thread: http://forums.opensuse.org/showthread.php?t=401905


  6. #6
    tsu2 NNTP User

    Default Re: updating klamav does not work


    Just verifying and clarification...

    AFAIK there is a problem updating the KlamAV application itself, there
    isn't necessarily a problem receiving signature updates.


    --
    tsu2
    ------------------------------------------------------------------------
    tsu2's Profile: http://forums.opensuse.org/member.php?userid=2578
    View this thread: http://forums.opensuse.org/showthread.php?t=401905


  7. #7
    caf4926 NNTP User

    Default Re: updating klamav does not work


    I was talking about the application not the v.sig's. I never actually
    use the darn thing.


    --
    Box: Linux 2.6.25.18-0.2 x86_64 | OS 11.0 | (KDE4.1.82) "3.1" | M2N4-SLI
    | AMD 64 X2 5200+ | nVidia 8500GT | 2GB RAM
    Lap: OS 11.0 | Celeron 550 | (KDE 4.1.82 "release 3.1" | Intel 965 GM |
    Lenovo R61e | 1GB RAM
    ------------------------------------------------------------------------
    caf4926's Profile: http://forums.opensuse.org/member.php?userid=204
    View this thread: http://forums.opensuse.org/showthread.php?t=401905


Posting Permissions

  • You may not post new threads
  • You may not post replies
  • You may not post attachments
  • You may not edit your posts
  •