Results 1 to 2 of 2

Thread: Trouble building e17

  1. #1

    Default Trouble building e17

    Hi, I am having trouble bulding e17, eva package went smoothly but the eet is giving me trouble. Here is the terminal output. This is on opensuse 12.2 gnome btw:

    Code:
    linux-226b:/home/gumboman/Downloads/eet-1.7.0 # make
    make  all-recursive
    make[1]: Entering directory `/home/gumboman/Downloads/eet-1.7.0'
    Making all in src
    make[2]: Entering directory `/home/gumboman/Downloads/eet-1.7.0/src'
    Making all in lib
    make[3]: Entering directory `/home/gumboman/Downloads/eet-1.7.0/src/lib'
      CC     eet_lib.lo
      CC     eet_node.lo
      CC     eet_utils.lo
      CC     lz4.lo
      CC     lz4hc.lo
      CCLD   libeet.la
    make[3]: Leaving directory `/home/gumboman/Downloads/eet-1.7.0/src/lib'
    Making all in bin
    make[3]: Entering directory `/home/gumboman/Downloads/eet-1.7.0/src/bin'
      CC     eet_main.o
      CCLD   eet
    ../../src/lib/.libs/libeet.so: undefined reference to `gcry_check_version'
    ../../src/lib/.libs/libeet.so: undefined reference to `gcry_control'
    collect2: error: ld returned 1 exit status
    make[3]: *** [eet] Error 1
    make[3]: Leaving directory `/home/gumboman/Downloads/eet-1.7.0/src/bin'
    make[2]: *** [all-recursive] Error 1
    make[2]: Leaving directory `/home/gumboman/Downloads/eet-1.7.0/src'
    make[1]: *** [all-recursive] Error 1
    make[1]: Leaving directory `/home/gumboman/Downloads/eet-1.7.0'
    make: *** [all] Error 2
    linux-226b:/home/gumboman/Downloads/eet-1.7.0 #

  2. #2

    Default Re: Trouble building e17

    Quote Originally Posted by gumboman View Post
    Hi, I am having trouble bulding e17, eva package went smoothly but the eet is giving me trouble. Here is the terminal output. This is on opensuse 12.2 gnome btw:

    Code:
    linux-226b:/home/gumboman/Downloads/eet-1.7.0 # make
    make  all-recursive
    make[1]: Entering directory `/home/gumboman/Downloads/eet-1.7.0'
    Making all in src
    make[2]: Entering directory `/home/gumboman/Downloads/eet-1.7.0/src'
    Making all in lib
    make[3]: Entering directory `/home/gumboman/Downloads/eet-1.7.0/src/lib'
      CC     eet_lib.lo
      CC     eet_node.lo
      CC     eet_utils.lo
      CC     lz4.lo
      CC     lz4hc.lo
      CCLD   libeet.la
    make[3]: Leaving directory `/home/gumboman/Downloads/eet-1.7.0/src/lib'
    Making all in bin
    make[3]: Entering directory `/home/gumboman/Downloads/eet-1.7.0/src/bin'
      CC     eet_main.o
      CCLD   eet
    ../../src/lib/.libs/libeet.so: undefined reference to `gcry_check_version'
    ../../src/lib/.libs/libeet.so: undefined reference to `gcry_control'
    collect2: error: ld returned 1 exit status
    make[3]: *** [eet] Error 1
    make[3]: Leaving directory `/home/gumboman/Downloads/eet-1.7.0/src/bin'
    make[2]: *** [all-recursive] Error 1
    make[2]: Leaving directory `/home/gumboman/Downloads/eet-1.7.0/src'
    make[1]: *** [all-recursive] Error 1
    make[1]: Leaving directory `/home/gumboman/Downloads/eet-1.7.0'
    make: *** [all] Error 2
    linux-226b:/home/gumboman/Downloads/eet-1.7.0 #
    fixed it by installing lua51-devel and removing lua52

Posting Permissions

  • You may not post new threads
  • You may not post replies
  • You may not post attachments
  • You may not edit your posts
  •