Results 1 to 2 of 2

Thread: OpenSuse 11.2- can't run VMware workstation 6.5.0

  1. #1

    Default OpenSuse 11.2- can't run VMware workstation 6.5.0

    I can install 'VMware-Workstation-6.5.0-118166.i386.bundle' without problems, but when I try to run #vmware in my terminal I get:

    64/Linux x86 # vmware
    Logging to /tmp/vmware-root/setup-2633.log
    ERROR: modinfo: could not find module vmmon
    ERROR: modinfo: could not find module vmnet
    ERROR: modinfo: could not find module vmblock
    ERROR: modinfo: could not find module vmci
    ERROR: modinfo: could not find module vsock
    ERROR: modinfo: could not find module vmmon
    ERROR: modinfo: could not find module vmnet
    ERROR: modinfo: could not find module vmblock
    ERROR: modinfo: could not find module vmci
    ERROR: modinfo: could not find module vsock
    ERROR: modinfo: could not find module vmmon
    ERROR: modinfo: could not find module vmnet
    ERROR: modinfo: could not find module vmblock
    ERROR: modinfo: could not find module vmci
    ERROR: modinfo: could not find module vsock
    ERROR: modinfo: could not find module vmmon
    ERROR: modinfo: could not find module vmnet
    ERROR: modinfo: could not find module vmblock
    ERROR: modinfo: could not find module vmci
    ERROR: modinfo: could not find module vsock
    ERROR: modinfo: could not find module vmmon
    ERROR: modinfo: could not find module vmnet
    ERROR: modinfo: could not find module vmblock
    ERROR: modinfo: could not find module vmci
    ERROR: modinfo: could not find module vsock
    ERROR: modinfo: could not find module vmmon
    ERROR: modinfo: could not find module vmnet
    ERROR: modinfo: could not find module vmblock
    ERROR: modinfo: could not find module vmci
    ERROR: modinfo: could not find module vsock
    Stopping VMware services:
    Virtual machine communication interface done
    Virtual machine monitor done
    Blocking file system done
    Using 2.6.x kernel build system.
    make: Entering directory `/tmp/vmware-root/modules/vmmon-only'
    make -C /lib/modules/2.6.31.12-0.2-default/build/include/.. SUBDIRS=$PWD SRCROOT=$PWD/. modules
    make[1]: Entering directory `/usr/src/linux-2.6.31.12-0.2-obj/i386/default'
    make -C ../../../linux-2.6.31.12-0.2 O=/usr/src/linux-2.6.31.12-0.2-obj/i386/default/. modules
    CC [M] /tmp/vmware-root/modules/vmmon-only/linux/driver.o
    In file included from /tmp/vmware-root/modules/vmmon-only/linux/driver.c:31:
    /tmp/vmware-root/modules/vmmon-only/./include/compat_wait.h:78: error: conflicting types for ‘poll_initwait’
    /usr/src/linux-2.6.31.12-0.2/include/linux/poll.h:70: note: previous declaration of ‘poll_initwait’ was here
    In file included from /tmp/vmware-root/modules/vmmon-only/./include/vmware.h:38,
    from /tmp/vmware-root/modules/vmmon-only/linux/driver.c:99:
    /tmp/vmware-root/modules/vmmon-only/./include/vm_basic_types.h:108:7: warning: "__FreeBSD__" is not defined
    In file included from /tmp/vmware-root/modules/vmmon-only/./common/vmx86.h:31,
    from /tmp/vmware-root/modules/vmmon-only/linux/driver.h:29,
    from /tmp/vmware-root/modules/vmmon-only/linux/driver.c:101:
    /tmp/vmware-root/modules/vmmon-only/./include/x86apic.h:97:1: warning: "APIC_BASE_MSR" redefined
    In file included from include2/asm/apic.h:11,
    from include2/asm/smp.h:13,
    from /usr/src/linux-2.6.31.12-0.2/include/linux/smp.h:36,
    from /usr/src/linux-2.6.31.12-0.2/include/linux/topology.h:33,
    from /usr/src/linux-2.6.31.12-0.2/include/linux/gfp.h:7,
    from /usr/src/linux-2.6.31.12-0.2/include/linux/kmod.h:22,
    from /usr/src/linux-2.6.31.12-0.2/include/linux/module.h:13,
    from /tmp/vmware-root/modules/vmmon-only/./include/compat_module.h:27,
    from /tmp/vmware-root/modules/vmmon-only/linux/driver.c:26:
    include2/asm/apicdef.h:135:1: warning: this is the location of the previous definition
    In file included from /tmp/vmware-root/modules/vmmon-only/./include/vcpuset.h:103,
    from /tmp/vmware-root/modules/vmmon-only/./include/modulecall.h:37,
    from /tmp/vmware-root/modules/vmmon-only/./common/vmx86.h:33,
    from /tmp/vmware-root/modules/vmmon-only/linux/driver.h:29,
    from /tmp/vmware-root/modules/vmmon-only/linux/driver.c:101:
    /tmp/vmware-root/modules/vmmon-only/./include/vm_atomic.h:329:7: warning: "_MSC_VER" is not defined
    /tmp/vmware-root/modules/vmmon-only/./include/vm_atomic.h:333:7: warning: "_MSC_VER" is not defined
    /tmp/vmware-root/modules/vmmon-only/./include/vm_atomic.h:401:7: warning: "_MSC_VER" is not defined
    /tmp/vmware-root/modules/vmmon-only/./include/vm_atomic.h:407:7: warning: "_MSC_VER" is not defined
    /tmp/vmware-root/modules/vmmon-only/./include/vm_atomic.h:506:7: warning: "_MSC_VER" is not defined
    /tmp/vmware-root/modules/vmmon-only/./include/vm_atomic.h:595:7: warning: "_MSC_VER" is not defined
    /tmp/vmware-root/modules/vmmon-only/./include/vm_atomic.h:684:7: warning: "_MSC_VER" is not defined
    /tmp/vmware-root/modules/vmmon-only/./include/vm_atomic.h:773:7: warning: "_MSC_VER" is not defined
    /tmp/vmware-root/modules/vmmon-only/./include/vm_atomic.h:775:7: warning: "_MSC_VER" is not defined
    /tmp/vmware-root/modules/vmmon-only/./include/vm_atomic.h:860:7: warning: "_MSC_VER" is not defined
    /tmp/vmware-root/modules/vmmon-only/./include/vm_atomic.h:862:7: warning: "_MSC_VER" is not defined
    /tmp/vmware-root/modules/vmmon-only/./include/vm_atomic.h:945:7: warning: "_MSC_VER" is not defined
    /tmp/vmware-root/modules/vmmon-only/./include/vm_atomic.h:947:7: warning: "_MSC_VER" is not defined
    /tmp/vmware-root/modules/vmmon-only/./include/vm_atomic.h:1028:7: warning: "_MSC_VER" is not defined
    /tmp/vmware-root/modules/vmmon-only/./include/vm_atomic.h:1030:7: warning: "_MSC_VER" is not defined
    /tmp/vmware-root/modules/vmmon-only/./include/vm_atomic.h:1223:7: warning: "_MSC_VER" is not defined
    /tmp/vmware-root/modules/vmmon-only/./include/vm_atomic.h:1227:7: warning: "_MSC_VER" is not defined
    /tmp/vmware-root/modules/vmmon-only/./include/vm_atomic.h:1536:7: warning: "_MSC_VER" is not defined
    /tmp/vmware-root/modules/vmmon-only/./include/vm_atomic.h:1663:7: warning: "_MSC_VER" is not defined
    In file included from /tmp/vmware-root/modules/vmmon-only/./include/vm_basic_asm.h:46,
    from /tmp/vmware-root/modules/vmmon-only/./include/rateconv.h:45,
    from /tmp/vmware-root/modules/vmmon-only/./include/modulecall.h:40,
    from /tmp/vmware-root/modules/vmmon-only/./common/vmx86.h:33,
    from /tmp/vmware-root/modules/vmmon-only/linux/driver.h:29,
    from /tmp/vmware-root/modules/vmmon-only/linux/driver.c:101:
    /tmp/vmware-root/modules/vmmon-only/./include/vm_basic_asm_x86.h:62:7: warning: "_MSC_VER" is not defined
    /tmp/vmware-root/modules/vmmon-only/./include/vm_basic_asm_x86.h:177:7: warning: "_MSC_VER" is not defined
    /tmp/vmware-root/modules/vmmon-only/./include/vm_basic_asm_x86.h:346:7: warning: "_MSC_VER" is not defined
    /tmp/vmware-root/modules/vmmon-only/./include/vm_basic_asm_x86.h:453:7: warning: "_MSC_VER" is not defined
    In file included from /tmp/vmware-root/modules/vmmon-only/./include/vm_asm.h:43,
    from /tmp/vmware-root/modules/vmmon-only/linux/driver.c:103:
    /tmp/vmware-root/modules/vmmon-only/./include/vm_asm_x86.h:486:7: warning: "_MSC_VER" is not defined
    /tmp/vmware-root/modules/vmmon-only/./include/vm_asm_x86.h:779:7: warning: "_MSC_VER" is not defined
    /tmp/vmware-root/modules/vmmon-only/./include/vm_asm_x86.h:820:7: warning: "_MSC_VER" is not defined
    /tmp/vmware-root/modules/vmmon-only/./include/vm_asm_x86.h:922:7: warning: "_MSC_VER" is not defined
    In file included from /tmp/vmware-root/modules/vmmon-only/linux/driver.c:119:
    /tmp/vmware-root/modules/vmmon-only/./common/hostif.h:53:7: warning: "WINNT_DDK" is not defined
    /tmp/vmware-root/modules/vmmon-only/linux/driver.c: In function ‘LinuxDriverSyncCallOnEachCPU’:
    /tmp/vmware-root/modules/vmmon-only/linux/driver.c:1423: error: too many arguments to function ‘smp_call_function’
    /tmp/vmware-root/modules/vmmon-only/linux/driver.c: In function ‘LinuxDriver_Ioctl’:
    /tmp/vmware-root/modules/vmmon-only/linux/driver.c:1987: error: ‘struct task_struct’ has no member named ‘euid’
    /tmp/vmware-root/modules/vmmon-only/linux/driver.c:1987: error: ‘struct task_struct’ has no member named ‘uid’
    /tmp/vmware-root/modules/vmmon-only/linux/driver.c:1988: error: ‘struct task_struct’ has no member named ‘fsuid’
    /tmp/vmware-root/modules/vmmon-only/linux/driver.c:1988: error: ‘struct task_struct’ has no member named ‘uid’
    /tmp/vmware-root/modules/vmmon-only/linux/driver.c:1989: error: ‘struct task_struct’ has no member named ‘egid’
    /tmp/vmware-root/modules/vmmon-only/linux/driver.c:1989: error: ‘struct task_struct’ has no member named ‘gid’
    /tmp/vmware-root/modules/vmmon-only/linux/driver.c:1990: error: ‘struct task_struct’ has no member named ‘fsgid’
    /tmp/vmware-root/modules/vmmon-only/linux/driver.c:1990: error: ‘struct task_struct’ has no member named ‘gid’
    /tmp/vmware-root/modules/vmmon-only/linux/driver.c:2007: error: too many arguments to function ‘smp_call_function’
    make[4]: *** [/tmp/vmware-root/modules/vmmon-only/linux/driver.o] Error 1
    make[3]: *** [_module_/tmp/vmware-root/modules/vmmon-only] Error 2
    make[2]: *** [sub-make] Error 2
    make[1]: *** [all] Error 2
    make[1]: Leaving directory `/usr/src/linux-2.6.31.12-0.2-obj/i386/default'
    make: *** [vmmon.ko] Error 2
    make: Leaving directory `/tmp/vmware-root/modules/vmmon-only'

    This is what I have installed:

    64/Linux x86 # rpm -qa kernel-*
    kernel-default-devel-2.6.31.12-0.2.1.i586
    kernel-desktop-2.6.31.12-0.2.1.i586
    kernel-default-2.6.31.12-0.2.1.i586
    kernel-xen-devel-2.6.31.12-0.2.1.i586
    kernel-desktop-base-2.6.31.12-0.2.1.i586
    kernel-syms-2.6.31.12-0.2.1.i586
    kernel-source-2.6.31.12-0.2.1.noarch
    kernel-desktop-devel-2.6.31.12-0.2.1.i586
    kernel-debug-devel-2.6.31.12-0.2.1.i586
    kernel-pae-devel-2.6.31.12-0.2.1.i586

    64/Linux x86 # rpm -qa linux-*
    linux-kernel-headers-2.6.31-3.4.noarch

    64/Linux x86 # rpm -qa gcc*
    gcc44-4.4.1_20090817-2.3.4.i586
    gcc-4.4-4.2.i586

  2. #2
    palladium NNTP User

    Default Re: OpenSuse 11.2- can't run VMware workstation 6.5.0

    marcelorjava wrote:
    > I can install 'VMware-Workstation-6.5.0-118166.i386.bundle' without
    > problems, but when I try to run #vmware in my terminal I get:


    try VBox, it is easy...even i could it working...use the forum's
    search function and you will find LOTS of folks agree..

    --
    palladium

Posting Permissions

  • You may not post new threads
  • You may not post replies
  • You may not post attachments
  • You may not edit your posts
  •