Page 1 of 3 123 LastLast
Results 1 to 10 of 22

Thread: Blackbox installing problem

  1. #1

    Default Blackbox installing problem

    Hi,
    sorry for my bad english, but im german 7th grade^^
    Its my first time using linux, and ive already got a problem:
    everytime when i try to ./configure blackbox 0.70.1 i get an error...
    Here is it (copied from console):
    Big-Blue@linux-v4yo:~> cd Desktop
    Big-Blue@linux-v4yo:~/Desktop> cd blackbox-0.70.1
    Big-Blue@linux-v4yo:~/Desktop/blackbox-0.70.1> ./configure
    checking for a BSD-compatible install... /usr/bin/install -c
    checking whether build environment is sane... yes
    checking for gawk... gawk
    checking whether make sets $(MAKE)... no
    checking for gcc... no
    checking for cc... no
    checking for cc... no
    checking for cl... no
    configure: error: no acceptable C compiler found in $PATH
    See `config.log' for more details.
    Big-Blue@linux-v4yo:~/Desktop/blackbox-0.70.1>
    config.log:
    This file contains any messages produced by compilers while
    running configure, to aid debugging if configure makes a mistake.

    It was created by blackbox configure 0.70.1, which was
    generated by GNU Autoconf 2.59. Invocation command line was

    $ ./configure

    ## --------- ##
    ## Platform. ##
    ## --------- ##

    hostname = linux-v4yo
    uname -m = i686
    uname -r = 2.6.25.18-0.2-default
    uname -s = Linux
    uname -v = #1 SMP 2008-10-21 16:30:26 +0200

    /usr/bin/uname -p = unknown
    /bin/uname -X = unknown

    /bin/arch = i686
    /usr/bin/arch -k = unknown
    /usr/convex/getsysinfo = unknown
    hostinfo = unknown
    /bin/machine = unknown
    /usr/bin/oslevel = unknown
    /bin/universe = unknown

    PATH: /home/Big-Blue/bin
    PATH: /usr/local/bin
    PATH: /usr/bin
    PATH: /bin
    PATH: /usr/bin/X11
    PATH: /usr/X11R6/bin
    PATH: /usr/games
    PATH: /usr/lib/jvm/jre/bin
    PATH: /usr/lib/mit/bin
    PATH: /usr/lib/mit/sbin
    PATH: .


    ## ----------- ##
    ## Core tests. ##
    ## ----------- ##

    configure:1581: checking for a BSD-compatible install
    configure:1636: result: /usr/bin/install -c
    configure:1647: checking whether build environment is sane
    configure:1690: result: yes
    configure:1755: checking for gawk
    configure:1771: found /usr/bin/gawk
    configure:1781: result: gawk
    configure:1791: checking whether make sets $(MAKE)
    configure:1815: result: no
    configure:2036: checking for gcc
    configure:2065: result: no
    configure:2116: checking for cc
    configure:2145: result: no
    configure:2158: checking for cc
    configure:2204: result: no
    configure:2257: checking for cl
    configure:2286: result: no
    configure:2300: error: no acceptable C compiler found in $PATH
    See `config.log' for more details.

    ## ---------------- ##
    ## Cache variables. ##
    ## ---------------- ##

    ac_cv_env_CC_set=
    ac_cv_env_CC_value=
    ac_cv_env_CFLAGS_set=
    ac_cv_env_CFLAGS_value=
    ac_cv_env_CPPFLAGS_set=
    ac_cv_env_CPPFLAGS_value=
    ac_cv_env_CPP_set=
    ac_cv_env_CPP_value=
    ac_cv_env_CXXCPP_set=
    ac_cv_env_CXXCPP_value=
    ac_cv_env_CXXFLAGS_set=
    ac_cv_env_CXXFLAGS_value=
    ac_cv_env_CXX_set=
    ac_cv_env_CXX_value=
    ac_cv_env_F77_set=
    ac_cv_env_F77_value=
    ac_cv_env_FFLAGS_set=
    ac_cv_env_FFLAGS_value=
    ac_cv_env_LDFLAGS_set=
    ac_cv_env_LDFLAGS_value=
    ac_cv_env_PKG_CONFIG_set=
    ac_cv_env_PKG_CONFIG_value=
    ac_cv_env_build_alias_set=
    ac_cv_env_build_alias_value=
    ac_cv_env_host_alias_set=
    ac_cv_env_host_alias_value=
    ac_cv_env_target_alias_set=
    ac_cv_env_target_alias_value=
    ac_cv_env_xft_CFLAGS_set=
    ac_cv_env_xft_CFLAGS_value=
    ac_cv_env_xft_LIBS_set=
    ac_cv_env_xft_LIBS_value=
    ac_cv_path_install='/usr/bin/install -c'
    ac_cv_prog_AWK=gawk
    ac_cv_prog_make_make_set=no

    ## ----------------- ##
    ## Output variables. ##
    ## ----------------- ##

    ACLOCAL='${SHELL} /home/Big-Blue/Desktop/blackbox-0.70.1/missing --run aclocal-1.9'
    AMDEPBACKSLASH=''
    AMDEP_FALSE=''
    AMDEP_TRUE=''
    AMTAR='${SHELL} /home/Big-Blue/Desktop/blackbox-0.70.1/missing --run tar'
    AR=''
    AUTOCONF='${SHELL} /home/Big-Blue/Desktop/blackbox-0.70.1/missing --run autoconf'
    AUTOHEADER='${SHELL} /home/Big-Blue/Desktop/blackbox-0.70.1/missing --run autoheader'
    AUTOMAKE='${SHELL} /home/Big-Blue/Desktop/blackbox-0.70.1/missing --run automake-1.9'
    AWK='gawk'
    CC=''
    CCDEPMODE=''
    CFLAGS=''
    CPP=''
    CPPFLAGS=' -I/usr/local/include'
    CXX=''
    CXXCPP=''
    CXXDEPMODE=''
    CXXFLAGS=''
    CYGPATH_W='echo'
    DEBUG=''
    DEFS=''
    DEPDIR=''
    ECHO='echo'
    ECHO_C=''
    ECHO_N='-n'
    ECHO_T=''
    EGREP=''
    EXEEXT=''
    F77=''
    FFLAGS=''
    ICONV=''
    INSTALL_DATA='${INSTALL} -m 644'
    INSTALL_PROGRAM='${INSTALL}'
    INSTALL_SCRIPT='${INSTALL}'
    INSTALL_STRIP_PROGRAM='${SHELL} $(install_sh) -c -s'
    LDFLAGS=' -L/usr/local/lib'
    LIBOBJS=''
    LIBS=''
    LIBTOOL=''
    LIBTOOL_DEPS=''
    LN_S=''
    LOCALE=''
    LTLIBOBJS=''
    MAINT=''
    MAINTAINER_MODE_FALSE=''
    MAINTAINER_MODE_TRUE=''
    MAKEINFO='${SHELL} /home/Big-Blue/Desktop/blackbox-0.70.1/missing --run makeinfo'
    MITSHM=''
    NLS=''
    OBJEXT=''
    PACKAGE='blackbox'
    PACKAGE_BUGREPORT='http://blackboxwm.sourceforge.net'
    PACKAGE_NAME='blackbox'
    PACKAGE_STRING='blackbox 0.70.1'
    PACKAGE_TARNAME='blackbox'
    PACKAGE_VERSION='0.70.1'
    PATH_SEPARATOR=':'
    PKG_CONFIG=''
    RANLIB=''
    SET_MAKE='MAKE=make'
    SHAPE=''
    SHELL='/bin/sh'
    STRIP=''
    VERSION='0.70.1'
    XFT=''
    XFT_PKGCONFIG=''
    ac_ct_AR=''
    ac_ct_CC=''
    ac_ct_CXX=''
    ac_ct_F77=''
    ac_ct_RANLIB=''
    ac_ct_STRIP=''
    ac_pt_PKG_CONFIG=''
    am__fastdepCC_FALSE=''
    am__fastdepCC_TRUE=''
    am__fastdepCXX_FALSE=''
    am__fastdepCXX_TRUE=''
    am__include=''
    am__leading_dot='.'
    am__quote=''
    am__tar='${AMTAR} chof - "$$tardir"'
    am__untar='${AMTAR} xf -'
    bindir='${exec_prefix}/bin'
    build=''
    build_alias=''
    build_cpu=''
    build_os=''
    build_vendor=''
    datadir='${prefix}/share'
    exec_prefix='NONE'
    gencat_cmd=''
    host=''
    host_alias=''
    host_cpu=''
    host_os=''
    host_vendor=''
    includedir='${prefix}/include'
    infodir='${prefix}/info'
    install_sh='/home/Big-Blue/Desktop/blackbox-0.70.1/install-sh'
    libdir='${exec_prefix}/lib'
    libexecdir='${exec_prefix}/libexec'
    localstatedir='${prefix}/var'
    mandir='${prefix}/man'
    mkdir_p='mkdir -p --'
    oldincludedir='/usr/include'
    prefix='/usr/local'
    program_transform_name='s,x,x,'
    regex_cmd=''
    sbindir='${exec_prefix}/sbin'
    sharedstatedir='${prefix}/com'
    sysconfdir='${prefix}/etc'
    target_alias=''
    xft_CFLAGS=''
    xft_LIBS=''

    ## ----------- ##
    ## confdefs.h. ##
    ## ----------- ##

    #define PACKAGE "blackbox"
    #define PACKAGE_BUGREPORT "http://blackboxwm.sourceforge.net"
    #define PACKAGE_NAME "blackbox"
    #define PACKAGE_STRING "blackbox 0.70.1"
    #define PACKAGE_TARNAME "blackbox"
    #define PACKAGE_VERSION "0.70.1"
    #define VERSION "0.70.1"

    configure: exit 1
    sorry, if it is very easy, but i dont understand "linux" cuz im coming from windows xD
    so what do ive got to do?
    greetz
    Big-Blue

  2. #2
    Join Date
    Jan 2008
    Location
    U.K East Anglia
    Posts
    2,581

    Default Re: Blackbox installing problem

    Ensure you have kernel sources,kernel syms,make,gcc/gcc++ installed & try again

    Andy
    To be is to do = Immanuel Kant
    To do is to be = Descartes.
    Do be do be do = Frank Sinatra

    SuSE user since 7.0,Linux user since 1994

  3. #3

    Default Re: Blackbox installing problem

    THX^^
    Now configuring works properly, but now "make" has got errors^^
    Console:
    Big-Blue@linux-v4yo:~/Desktop/blackbox-0.70.1> make
    make all-recursive
    make[1]: Entering directory `/home/Big-Blue/Desktop/blackbox-0.70.1'
    Making all in data
    make[2]: Entering directory `/home/Big-Blue/Desktop/blackbox-0.70.1/data'
    Making all in styles
    make[3]: Entering directory `/home/Big-Blue/Desktop/blackbox-0.70.1/data/styles'
    make[3]: Fr das Ziel all ist nichts zu tun.
    make[3]: Leaving directory `/home/Big-Blue/Desktop/blackbox-0.70.1/data/styles'
    make[3]: Entering directory `/home/Big-Blue/Desktop/blackbox-0.70.1/data'
    sed -e "s,@pkgdatadir@,/usr/local/share/blackbox," ./menu.in > menu
    make[3]: Leaving directory `/home/Big-Blue/Desktop/blackbox-0.70.1/data'
    make[2]: Leaving directory `/home/Big-Blue/Desktop/blackbox-0.70.1/data'
    Making all in doc
    make[2]: Entering directory `/home/Big-Blue/Desktop/blackbox-0.70.1/doc'
    sed -e "s,@defaultmenu@,/usr/local/share/blackbox/menu," \
    -e "s,@pkgdatadir@,/usr/local/share/blackbox," \
    -e "s,@version@,0.70.1," \
    ./blackbox.1.in > blackbox.1
    make[2]: Leaving directory `/home/Big-Blue/Desktop/blackbox-0.70.1/doc'
    Making all in lib
    make[2]: Entering directory `/home/Big-Blue/Desktop/blackbox-0.70.1/lib'
    if /bin/sh ../libtool --tag=CXX --mode=compile g++ -DHAVE_CONFIG_H -I. -I. -I.. -DSHAPE -DMITSHM -DXFT -DNLS -DLOCALEPATH=\"/usr/local/share/blackbox/nls\" -I/usr/local/include -g -O2 -I/usr/include/freetype2 -MT Application.lo -MD -MP -MF ".deps/Application.Tpo" -c -o Application.lo Application.cc; \
    then mv -f ".deps/Application.Tpo" ".deps/Application.Plo"; else rm -f ".deps/Application.Tpo"; exit 1; fi
    g++ -DHAVE_CONFIG_H -I. -I. -I.. -DSHAPE -DMITSHM -DXFT -DNLS -DLOCALEPATH=\"/usr/local/share/blackbox/nls\" -I/usr/local/include -g -O2 -I/usr/include/freetype2 -MT Application.lo -MD -MP -MF .deps/Application.Tpo -c Application.cc -o Application.o
    if /bin/sh ../libtool --tag=CXX --mode=compile g++ -DHAVE_CONFIG_H -I. -I. -I.. -DSHAPE -DMITSHM -DXFT -DNLS -DLOCALEPATH=\"/usr/local/share/blackbox/nls\" -I/usr/local/include -g -O2 -I/usr/include/freetype2 -MT Bitmap.lo -MD -MP -MF ".deps/Bitmap.Tpo" -c -o Bitmap.lo Bitmap.cc; \
    then mv -f ".deps/Bitmap.Tpo" ".deps/Bitmap.Plo"; else rm -f ".deps/Bitmap.Tpo"; exit 1; fi
    g++ -DHAVE_CONFIG_H -I. -I. -I.. -DSHAPE -DMITSHM -DXFT -DNLS -DLOCALEPATH=\"/usr/local/share/blackbox/nls\" -I/usr/local/include -g -O2 -I/usr/include/freetype2 -MT Bitmap.lo -MD -MP -MF .deps/Bitmap.Tpo -c Bitmap.cc -o Bitmap.o
    if /bin/sh ../libtool --tag=CXX --mode=compile g++ -DHAVE_CONFIG_H -I. -I. -I.. -DSHAPE -DMITSHM -DXFT -DNLS -DLOCALEPATH=\"/usr/local/share/blackbox/nls\" -I/usr/local/include -g -O2 -I/usr/include/freetype2 -MT Color.lo -MD -MP -MF ".deps/Color.Tpo" -c -o Color.lo Color.cc; \
    then mv -f ".deps/Color.Tpo" ".deps/Color.Plo"; else rm -f ".deps/Color.Tpo"; exit 1; fi
    g++ -DHAVE_CONFIG_H -I. -I. -I.. -DSHAPE -DMITSHM -DXFT -DNLS -DLOCALEPATH=\"/usr/local/share/blackbox/nls\" -I/usr/local/include -g -O2 -I/usr/include/freetype2 -MT Color.lo -MD -MP -MF .deps/Color.Tpo -c Color.cc -o Color.o
    if /bin/sh ../libtool --tag=CXX --mode=compile g++ -DHAVE_CONFIG_H -I. -I. -I.. -DSHAPE -DMITSHM -DXFT -DNLS -DLOCALEPATH=\"/usr/local/share/blackbox/nls\" -I/usr/local/include -g -O2 -I/usr/include/freetype2 -MT Display.lo -MD -MP -MF ".deps/Display.Tpo" -c -o Display.lo Display.cc; \
    then mv -f ".deps/Display.Tpo" ".deps/Display.Plo"; else rm -f ".deps/Display.Tpo"; exit 1; fi
    g++ -DHAVE_CONFIG_H -I. -I. -I.. -DSHAPE -DMITSHM -DXFT -DNLS -DLOCALEPATH=\"/usr/local/share/blackbox/nls\" -I/usr/local/include -g -O2 -I/usr/include/freetype2 -MT Display.lo -MD -MP -MF .deps/Display.Tpo -c Display.cc -o Display.o
    if /bin/sh ../libtool --tag=CXX --mode=compile g++ -DHAVE_CONFIG_H -I. -I. -I.. -DSHAPE -DMITSHM -DXFT -DNLS -DLOCALEPATH=\"/usr/local/share/blackbox/nls\" -I/usr/local/include -g -O2 -I/usr/include/freetype2 -MT EWMH.lo -MD -MP -MF ".deps/EWMH.Tpo" -c -o EWMH.lo EWMH.cc; \
    then mv -f ".deps/EWMH.Tpo" ".deps/EWMH.Plo"; else rm -f ".deps/EWMH.Tpo"; exit 1; fi
    g++ -DHAVE_CONFIG_H -I. -I. -I.. -DSHAPE -DMITSHM -DXFT -DNLS -DLOCALEPATH=\"/usr/local/share/blackbox/nls\" -I/usr/local/include -g -O2 -I/usr/include/freetype2 -MT EWMH.lo -MD -MP -MF .deps/EWMH.Tpo -c EWMH.cc -o EWMH.o
    if /bin/sh ../libtool --tag=CXX --mode=compile g++ -DHAVE_CONFIG_H -I. -I. -I.. -DSHAPE -DMITSHM -DXFT -DNLS -DLOCALEPATH=\"/usr/local/share/blackbox/nls\" -I/usr/local/include -g -O2 -I/usr/include/freetype2 -MT Font.lo -MD -MP -MF ".deps/Font.Tpo" -c -o Font.lo Font.cc; \
    then mv -f ".deps/Font.Tpo" ".deps/Font.Plo"; else rm -f ".deps/Font.Tpo"; exit 1; fi
    g++ -DHAVE_CONFIG_H -I. -I. -I.. -DSHAPE -DMITSHM -DXFT -DNLS -DLOCALEPATH=\"/usr/local/share/blackbox/nls\" -I/usr/local/include -g -O2 -I/usr/include/freetype2 -MT Font.lo -MD -MP -MF .deps/Font.Tpo -c Font.cc -o Font.o
    Font.cc: In member function '_XOC* bt::FontCache::findFontSet(const std::string&)':
    Font.cc:207: warning: deprecated conversion from string constant to 'char*'
    if /bin/sh ../libtool --tag=CXX --mode=compile g++ -DHAVE_CONFIG_H -I. -I. -I.. -DSHAPE -DMITSHM -DXFT -DNLS -DLOCALEPATH=\"/usr/local/share/blackbox/nls\" -I/usr/local/include -g -O2 -I/usr/include/freetype2 -MT Image.lo -MD -MP -MF ".deps/Image.Tpo" -c -o Image.lo Image.cc; \
    then mv -f ".deps/Image.Tpo" ".deps/Image.Plo"; else rm -f ".deps/Image.Tpo"; exit 1; fi
    g++ -DHAVE_CONFIG_H -I. -I. -I.. -DSHAPE -DMITSHM -DXFT -DNLS -DLOCALEPATH=\"/usr/local/share/blackbox/nls\" -I/usr/local/include -g -O2 -I/usr/include/freetype2 -MT Image.lo -MD -MP -MF .deps/Image.Tpo -c Image.cc -o Image.o
    Image.cc: In member function 'void bt::Image::hgradient(const bt::Color&, const bt::Color&, bool)':
    Image.cc:1350: error: 'memcpy' was not declared in this scope
    make[2]: *** [Image.lo] Fehler 1
    make[2]: Leaving directory `/home/Big-Blue/Desktop/blackbox-0.70.1/lib'
    make[1]: *** [all-recursive] Fehler 1
    make[1]: Leaving directory `/home/Big-Blue/Desktop/blackbox-0.70.1'
    make: *** [all] Fehler 2
    Big-Blue@linux-v4yo:~/Desktop/blackbox-0.70.1>
    I know im a noob
    Greetz^^

  4. #4

    Default Re: Blackbox installing problem

    Isnt there anyone who can help me?

  5. #5
    Join Date
    Sep 2008
    Location
    Brighton, United Kingdom
    Posts
    24

    Default Re: Blackbox installing problem

    Hey there, I might be wrong but it's worth a try. When using the make command, I think you have to be logged in as root, so before starting to build the program, use the command:

    Code:
    su root
    then try running the commands.

    Dan

  6. #6

    Default Re: Blackbox installing problem

    hmm, now i installed it, but how do i set it as primary windowmanager?

  7. #7
    Join Date
    Jan 2008
    Location
    U.K East Anglia
    Posts
    2,581

    Default Re: Blackbox installing problem

    have you checked the sessions menu before log-in ? Or YaST - System - /etc/sysconfig Editor,then click on Desktop - window manager DEFAULT_WM & change to whichever

    Andy
    To be is to do = Immanuel Kant
    To do is to be = Descartes.
    Do be do be do = Frank Sinatra

    SuSE user since 7.0,Linux user since 1994

  8. #8
    Join Date
    Mar 2011
    Location
    melbourne
    Posts
    27

    Default Re: Blackbox installing problem

    Feel its a bit late to put this comment in here, but thought it was better than raising a new thread with the same issue..

    openSuse 11.4, kernal sources, syms, gcc all... and i do get the same error (even when run as root ,sudo make)

    "Image.cc:1350:42: error: 'memcpy' was not declared in this scope

    can i please get some help?

  9. #9
    Join Date
    Mar 2011
    Location
    melbourne
    Posts
    27

    Default Re: Blackbox installing problem

    Quote Originally Posted by viktordtn View Post
    Feel its a bit late to put this comment in here, but thought it was better than raising a new thread with the same issue..

    openSuse 11.4, kernal sources, syms, gcc all... and i do get the same error (even when run as root ,sudo make)

    "Image.cc:1350:42: error: 'memcpy' was not declared in this scope

    can i please get some help?
    Found out the solution by just reading up "memcopy c++" through google and when looked into the code library files (in this case Image.cc, Resource.cc) fixed them and ran make as su. Hit another one, which looks like a code issue again. Can someone help out here because my C++ skils = 10/100

    the error

    Util.cc:197:64: error: 'std::string bt::textPropertyToString(Display*, XTextProperty&)' should have been declared inside 'bt

    the code which looks not so right interms of declarations, could be wrng

    std::string bt::textPropertyToString(:isplay *display,
    :TextProperty& text_prop) {
    std::string ret;


    if (text_prop.value && text_prop.nitems > 0) {
    if (text_prop.encoding == XA_STRING) {
    ret = reinterpret_cast<char *>(text_prop.value);
    } else {
    text_prop.nitems = strlen(reinterpret_cast<char *>(text_prop.value));

    char **list;
    int num;
    if (XmbTextPropertyToTextList(display, &text_prop,
    &list, &num) == Success &&
    num > 0 && *list) {
    ret = *list;
    XFreeStringList(list);
    }
    }
    }

    return ret;
    }

  10. #10

    Default Re: Blackbox installing problem

    HI,


    Sorry I can't help you, but I think you should post that question in the Developement forum....

    HTH

    Wenwolf

Page 1 of 3 123 LastLast

Posting Permissions

  • You may not post new threads
  • You may not post replies
  • You may not post attachments
  • You may not edit your posts
  •