Results 1 to 5 of 5

Thread: Koolsmoothdock make errors

  1. #1

    Default Koolsmoothdock make errors

    Hi there,
    When trying to make koolsmoothdock, i get this output:

    make all-recursive
    make[1]: Entering directory `/home/mystx/ksmoothdock'
    Making all in doc
    make[2]: Entering directory `/home/mystx/ksmoothdock/doc'
    Making all in .
    make[3]: Entering directory `/home/mystx/ksmoothdock/doc'
    make[3]: Nothing to be done for `all-am'.
    make[3]: Leaving directory `/home/mystx/ksmoothdock/doc'
    Making all in en
    make[3]: Entering directory `/home/mystx/ksmoothdock/doc/en'
    make[3]: Nothing to be done for `all'.
    make[3]: Leaving directory `/home/mystx/ksmoothdock/doc/en'
    make[2]: Leaving directory `/home/mystx/ksmoothdock/doc'
    Making all in po
    make[2]: Entering directory `/home/mystx/ksmoothdock/po'
    make[2]: Nothing to be done for `all'.
    make[2]: Leaving directory `/home/mystx/ksmoothdock/po'
    Making all in src
    make[2]: Entering directory `/home/mystx/ksmoothdock/src'
    if g++ -DHAVE_CONFIG_H -I. -I. -I.. -I/opt/kde3/include -I/usr/lib/qt3/include -I. -DQT_THREAD_SUPPORT -D_REENTRANT -Wno-long-long -Wundef -ansi -D_XOPEN_SOURCE=500 -D_BSD_SOURCE -Wcast-align -Wconversion -Wchar-subscripts -Wall -W-Wpointer-arith -O2 -Wformat-security -Wmissing-format-attribute -Wno-non-virtual-dtor -fno-exceptions -fno-check-new -fno-common -MT main.o -MD -MP -MF ".deps/main.Tpo" -c -o main.o main.cpp; \
    then mv -f ".deps/main.Tpo" ".deps/main.Po"; else rm -f ".deps/main.Tpo"; exit 1; fi
    In file included from /usr/lib/qt3/include/qwindowdefs.h:47,
    from /usr/lib/qt3/include/qwidget.h:45,
    from ksmoothdock.h:31,
    from main.cpp:22:
    /usr/lib/qt3/include/qstring.h: In member function char QChar::latin1() const:
    /usr/lib/qt3/include/qstring.h:197: warning: conversion to char from int may alter its value
    /usr/lib/qt3/include/qstring.h: In member function void QChar::setCell(uchar):
    /usr/lib/qt3/include/qstring.h:222: warning: conversion to ushort from int may alter its value
    /usr/lib/qt3/include/qstring.h: In member function void QChar::setRow(uchar):
    /usr/lib/qt3/include/qstring.h:223: warning: conversion to ushort from int may alter its value
    /usr/lib/qt3/include/qstring.h: In constructor QChar::QChar(uchar, uchar):
    /usr/lib/qt3/include/qstring.h:267: warning: conversion to ushort from int may alter its value
    /usr/lib/qt3/include/qstring.h: In constructor QStringData::QStringData(QChar*, uint, uint):
    /usr/lib/qt3/include/qstring.h:365: warning: conversion to unsigned int:30 from uint may alter its value
    /usr/lib/qt3/include/qstring.h:365: warning: conversion to unsigned int:30 from uint may alter its value
    In file included from /usr/lib/qt3/include/qobject.h:48,
    from /usr/lib/qt3/include/qwidget.h:46,
    from ksmoothdock.h:31,
    from main.cpp:22:
    /usr/lib/qt3/include/qevent.h: In member function void QDropEvent::setAction(QDropEvent::Action):
    /usr/lib/qt3/include/qevent.h:523: warning: conversion to unsigned char from uint may alter its value
    In file included from /usr/lib/qt3/include/qwidget.h:52,
    from ksmoothdock.h:31,
    from main.cpp:22:
    /usr/lib/qt3/include/qsizepolicy.h: In member function void QSizePolicy::transpose():
    /usr/lib/qt3/include/qsizepolicy.h:125: warning: conversion to uchar from uint may alter its value
    /usr/lib/qt3/include/qsizepolicy.h:125: warning: conversion to uchar from uint may alter its value
    In file included from main.cpp:22:
    ksmoothdock.h: At global scope:
    ksmoothdock.h:313: error: ISO C++ forbids declaration of auto_ptr with no type
    ksmoothdock.h:313: error: invalid use of ::
    ksmoothdock.h:313: error: expected ; before < token
    ksmoothdock.h:314: error: ISO C++ forbids declaration of auto_ptr with no type
    ksmoothdock.h:314: error: invalid use of ::
    ksmoothdock.h:314: error: expected ; before < token
    ksmoothdock.h:315: error: ISO C++ forbids declaration of auto_ptr with no type
    ksmoothdock.h:315: error: invalid use of ::
    ksmoothdock.h:315: error: expected ; before < token
    ksmoothdock.h:318: error: ISO C++ forbids declaration of auto_ptr with no type
    ksmoothdock.h:318: error: invalid use of ::
    ksmoothdock.h:318: error: expected ; before < token
    make[2]: *** [main.o] Error 1
    make[2]: Leaving directory `/home/mystx/ksmoothdock/src'
    make[1]: *** [all-recursive] Error 1
    make[1]: Leaving directory `/home/mystx/ksmoothdock'
    make: *** [all] Error 2


    Any ideas?
    thanks

  2. #2
    Join Date
    Jun 2008
    Location
    PHX
    Posts
    481

    Default Re: Koolsmoothdock make errors

    Have you tried the One Click Install from the factory repo?
    <>---><^>

  3. #3

    Default Re: Koolsmoothdock make errors

    Hmm, just tried that link, but Yast gave me "The install link or file you opened does not contain instructions for this version of openSUSE."

  4. #4
    Join Date
    Jun 2008
    Location
    PHX
    Posts
    481

    Default Re: Koolsmoothdock make errors

    I think I would just try rebuilding the SRPM package.

    # rpmbuild --rebuild --clean ~.src.rpm
    <>---><^>

  5. #5

    Default Re: Koolsmoothdock make errors

    Hmm.. that gives me the same errors as above..

Posting Permissions

  • You may not post new threads
  • You may not post replies
  • You may not post attachments
  • You may not edit your posts
  •