Results 1 to 3 of 3

Thread: Problems installing mscore, "cannot find ljack"

  1. #1

    Unhappy Problems installing mscore, "cannot find ljack"

    Hi, I have just reinstalled suse 32 bit as 64 bit didn't support some of my hardware.

    Trying to install mscore, during make release, this error message appeared at the end, saying can't find ljack, any ideas?

    Linking CXX executable mscore
    /usr/lib/gcc/i586-suse-linux/4.3/../../../../i586-suse-linux/bin/ld: cannot find -ljack
    collect2: ld returned 1 exit status
    make[3]: *** [mscore/mscore] Error 1
    make[3]: Leaving directory `/home/star/mscore-0.9.2/build'
    make[2]: *** [mscore/CMakeFiles/mscore.dir/all] Error 2
    make[2]: Leaving directory `/home/star/mscore-0.9.2/build'
    make[1]: *** [all] Error 2
    make[1]: Leaving directory `/home/star/mscore-0.9.2/build'
    make: *** [release] Error 2

    I have installed cmake, gnome c++ qt4 development from yast, confused, cause the same file installed fine on my last system.

    Thanks

  2. #2
    Join Date
    Jun 2008
    Location
    Podunk
    Posts
    26,516
    Blog Entries
    15

    Default Re: Problems installing mscore, "cannot find ljack"

    Quote Originally Posted by fallenstar
    Hi, I have just reinstalled suse 32 bit as 64 bit didn't support some of
    my hardware.

    Trying to install mscore, during make release, this error message
    appeared at the end, saying can't find ljack, any ideas?

    Linking CXX executable mscore
    /usr/lib/gcc/i586-suse-linux/4.3/../../../../i586-suse-linux/bin/ld:
    cannot find -ljack
    collect2: ld returned 1 exit status
    make[3]: *** [mscore/mscore] Error 1
    make[3]: Leaving directory `/home/star/mscore-0.9.2/build'
    make[2]: *** [mscore/CMakeFiles/mscore.dir/all] Error 2
    make[2]: Leaving directory `/home/star/mscore-0.9.2/build'
    make[1]: *** [all] Error 2
    make[1]: Leaving directory `/home/star/mscore-0.9.2/build'
    make: *** [release] Error 2

    I have installed cmake, gnome c++ qt4 development from yast, confused,
    cause the same file installed fine on my last system.

    Thanks
    Hi
    That is probably libjack-devel you require.

    --
    Cheers Malcolm (Linux Counter #276890)
    openSUSE 11.0 x86 Kernel 2.6.25.16-0.1-default
    up 5 days 0:18, 1 user, load average: 0.08, 0.04, 0.03
    GPU GeForce 6600 TE/6200 TE - Driver Version: 173.14.12


  3. #3

    Thumbs up Re: Problems installing mscore, "cannot find ljack"

    Thanks, that did it!

Posting Permissions

  • You may not post new threads
  • You may not post replies
  • You may not post attachments
  • You may not edit your posts
  •