Results 1 to 3 of 3

Thread: compiling Fluxbox-1.0.0 under openSUSE 11

  1. #1
    grethe NNTP User

    Default compiling Fluxbox-1.0.0 under openSUSE 11

    Hi

    Im trying to compile fluxbox-1.0.0 (latest version) for my fully updated openSuse 11.

    I have done the:
    Code:
    ./configure
    and I'm now trying to run
    Code:
    make
    but i get this error:
    Code:
    main.cc: In function ‘void showInfo(std::ostream&)’:
    main.cc:71: error: ‘strlen’ was not declared in this scope
    make[4]: *** [main.o] Error 1
    make[4]: Leaving directory `/home/rasmus/fluxbox-1.0.0/src'
    make[3]: *** [all-recursive] Error 1
    make[3]: Leaving directory `/home/rasmus/fluxbox-1.0.0/src'
    make[2]: *** [all] Error 2
    make[2]: Leaving directory `/home/rasmus/fluxbox-1.0.0/src'
    make[1]: *** [all-recursive] Error 1
    make[1]: Leaving directory `/home/rasmus/fluxbox-1.0.0'
    make: *** [all] Error 2
    Can anyone help? Thanks

  2. #2
    Olav P. NNTP User

    Default Re: compiling Fluxbox-1.0.0 under openSUSE 11

    grethe wrote:

    >
    > Hi
    >
    > Im trying to compile fluxbox-1.0.0 (latest version) for my fully


    Why not install the rpm?

    http://download.opensuse.org/reposit.../openSUSE_11.0

  3. #3
    grethe NNTP User

    Default Re: compiling Fluxbox-1.0.0 under openSUSE 11

    Hehe.. if I just knew it was that simple...
    Thanks a lot! - It works now.

Posting Permissions

  • You may not post new threads
  • You may not post replies
  • You may not post attachments
  • You may not edit your posts
  •